{"text_format":"1","workbook":"xlsx","n_sheets":7,"sheets":["1) Kumulativní rozpočet","KR zdroj","KR výstup","2) Stanovení jednotkové podpory","SJP Pomocné hodnoty","3) Výsledná podpora v AIS","VP pomocné hodnoty"],"not_rendered":{"charts":0,"images":7,"macros":1,"external_links":1,"defined_names":19,"comments":4,"pivot_tables":0},"unopened":[],"bounds":{"document_bytes":16777216,"sheet_cells":100000,"rows_first":2000,"rows_last":500,"rows_between":2000,"halvings":0,"cell_chars":16384,"cell_head_chars":4096},"cells_cut":0,"cells_raw":0,"read":"whole","date_system":"1900"}

{"sheet":"1) Kumulativní rozpočet","index":0,"n_rows":60,"n_cols":10,"rows_kept":60,"cut":false,"hidden":false,"merged":[[1,1,1,6],[14,3,14,6],[21,6,26,8],[2,3,2,5],[4,2,4,5],[4,8,4,9],[5,2,5,5],[5,8,5,9],[16,3,16,8]]}
[null,null,null,null,null,null,null,null,"verze 30. 9. 2025"]
[null,"NPŽP - Kumulativní rozpočet projektu"]
[null,null,"Editujte pouze zelená pole nebo použijte výběrová tlačítka","Důležité informace jsou označeny v komentáři u daných buněk."]
[]
[null,"Název žadatele:"]
[null,"Název projektu:"]
[]
[null,"DPH uznatelnost:"]
[null,null,null,null,null,null," "]
[null,"Souhrnný rozpočet"]
[null,null,null,"Výdaje bez DPH","DPH %","Výdaje s DPH","Nezpůsobilá část z celkových výdajů stanovená žadatelem (bez DPH)","Nezpůsobilá část celkem","Způsobilé výdaje po zohlednění limitů způsobilých nákladů a způsobilosti DPH"]
[null,"Realizace","Výdaje na realizaci",null,21,{"$f":"D12*(1+(E12/100))","v":0},0,{"$f":"CHOOSE('KR zdroj'!$P$26,G12*(1+('1) Kumulativní rozpočet'!E12/100)),D12*(E12/100)+G12,G12*(1+('1) Kumulativní rozpočet'!E12/100)),\"vyber uznatelnost DPH\")","v":0},{"$f":"IFERROR(F12-H12,\"zadej výdaje/uznatelnost DPH\")","v":0}]
[null,null,"Celkem",{"$f":"SUM(D12:D12)","v":0},null,{"$f":"SUM(F12:F12)","v":0},null,{"$f":"SUM(H12:H12)","v":0},{"$f":"IFERROR(I12,\"zadej výdaje/uznatelnost DPH\")","v":0}," = Celk. zp. výdaje (realizace)"]
[null,null,null,null,null,null,null,null,{"$f":"IFERROR(I12,\"zadej výdaje/uznatelnost DPH\")","v":0}," = Celk. zp. přímé realizační výdaje"]
[null,null,null,null,null,null,null,null,{"$f":"IFERROR(I14*'KR zdroj'!P30,0)","v":0},"moje ctrl - vymazat"]
[null,null,null,null,null,null,null,null,{"$f":"CHOOSE('KR zdroj'!$P$26,$D$17,$D$17*(1+($E$12/100)),$D$17,0)","v":0}]
[null,"PP + TDI + AD + BOZP + publicita","Nepřímé výdaje",{"$f":"IF(OR(J17<=15000000,J17=\"zadej výdaje/uznatelnost DPH\"),J17,15000000)","v":0},null,null,null,null,null,{"$f":"IFERROR('KR zdroj'!P32*'1) Kumulativní rozpočet'!I14,\"zadej výdaje/uznatelnost DPH\")","v":0}]
[]
[null,null,null,{"$f":"CHOOSE('KR zdroj'!P2,0,0,0,0,0,'1) Kumulativní rozpočet'!D18,'1) Kumulativní rozpočet'!D18,'1) Kumulativní rozpočet'!D18,'1) Kumulativní rozpočet'!D18,'1) Kumulativní rozpočet'!D18,'1) Kumulativní rozpočet'!D18,'1) Kumulativní rozpočet'!D18,'1) Kumulativní rozpočet'!D18,'1) Kumulativní rozpočet'!D18,0,'1) Kumulativní rozpočet'!D18,'1) Kumulativní rozpočet'!D18,0,0,'1) Kumulativní rozpočet'!D18)","v":0},null,{"$f":"(D19)*(1+(E12/100))","v":0},null,{"$f":"CHOOSE('KR zdroj'!P2,0,0,0,0,0,'1) Kumulativní rozpočet'!H18,'1) Kumulativní rozpočet'!H18,'1) Kumulativní rozpočet'!H18,'1) Kumulativní rozpočet'!H18,'1) Kumulativní rozpočet'!H18,'1) Kumulativní rozpočet'!H18,'1) Kumulativní rozpočet'!H18,'1) Kumulativní rozpočet'!H18,'1) Kumulativní rozpočet'!H18,0,'1) Kumulativní rozpočet'!H18,'1) Kumulativní rozpočet'!H18,0,0,'1) Kumulativní rozpočet'!H18)","v":0},0]
[null,{"$f":"IF(D20=\"zadej výdaje/DPH\",0,D20)","v":0},"Celkové výdaje projektu",{"$f":"IFERROR(IF(F13+I16+F19=0,\"zadej výdaje/DPH\",F13+I16+F19),\"zadej výdaje/DPH\")","v":"zadej výdaje/DPH"}]
{"$rows_left_out":41}
{"sheet":"KR zdroj","index":1,"n_rows":83,"n_cols":20,"rows_kept":83,"cut":false,"hidden":true,"merged":[]}
[{"$f":"OR(C10=2,C10=3,C10=5,C10=6,C10=11)","v":false},null,1,"Vyber Specifický cíl",null,null,null,null,null,null,null,{"$f":"CHOOSE($C$1,1,0,0,0,0,0,0)","v":1},"Vyber nejprve Specifický cíl a poté hlavní Opatření projektu","1_1",null,null,null,"paušál PP"]
[{"$f":"AND(A1=TRUE,C1=6)","v":false},null,2,"1.1 Podpora energetické účinnosti a snižování emisí skleníkových plynů",null,null,null,null,null,null,null,1,"1.1.1 Snížení energetické náročnosti veřejných budov a veřejné infrastruktury","2_1",{"$f":"IF(OR(AND(P2>5,P2<15),P2=16,P2=17,P2=20),1,0)","v":0},1,"mimo Veřejnou podporu",1]
[null,null,null,"1.2 Podpora energie z obnovitelných zdrojů v souladu se směrnicí (EU) 2018/2001, včetně kritérií udržitelnosti stanovených v uvedené směrnici",null,null,null,null,null,null,null,2,"1.1.2 Snížení energetické náročnosti/zvýšení účinnosti technologických procesů","2_2",null,null,"de minimis 360/2012 ",2,null," "]
[null,null,null,"1.3 Podpora přizpůsobení se změně klimatu, prevence rizika katastrof a odolnosti vůči nim s přihlédnutím k ekosystémovým přístupům",null,null,null,null,null,null,null,3,"1.1.3 Zlepšení kvality vnitřního prostředí veřejných budov","2_3",null,null,"de minimis 1407/2013 ",3,null," "]
[null,null,null,"1.4 Podpora přístupu k vodě a udržitelného hospodaření s vodou",null,null,null,null,null,null,null,4,"1.1.4 Zvýšení adaptability veřejných budov na změnu klimatu","2_4",null,null,"de minimis 1408/2013 ",4,null," "]
[null,null,null,"1.5 Podpora přechodu na oběhové hospodářství účinně využívající zdroje",null,null,null,null,null,null,null,5,"1.1.5 Výstavba nových veřejných budov, které budou splňovat parametry pro pasivní nebo plusové budovy","2_5",null,null,"de minimis 717/2014 ",5,null," "]
[null,null,null,"1.6 Posilování ochrany a zachování přírody, biologické rozmanitosti a zelené infrastruktury, a to i v městských oblastech, a snižování všech forem znečištění",null,null,null,null,null,null,null,6,"1.2.1 Výstavba a rekonstrukce obnovitelných zdrojů energie pro veřejné budovy","3_1",null,null,"GBER článek 14",null,null," "]
[null,null,null,null,null,null,null,null,null,null,null,7,"1.2.2 Výstavba a rekonstrukce obnovitelných zdrojů energie pro zajištění dodávek systémové energie ve veřejném sektoru","3_2",null,null,"GBER ŽP článek 36"]
[null,null,null,null,null,null,null,null,null,null,null,8,"1.2.3 Výměna nevyhovujících spalovacích zdrojů na tuhá paliva a pořizování domovních předávacích stanic","3_3",null,null,"GBER ŽP článek 38"]
[null,null,4,{"$f":"CHOOSE($C$1,$M$1,M2,M7,M10,M20,M25,M36)","v":"Vyber nejprve Specifický cíl a poté hlavní Opatření projektu"},null,null,null,null,null,null,null,9,"1.3.1 Podpora přírodě blízkých opatření v krajině a sídlech","4_1",null,null,"GBER ŽP článek 40"]
[null,null,null,{"$f":"CHOOSE($C$1,$M$1,M3,M8,M11,M21,M26,M37)","v":"Vyber nejprve Specifický cíl a poté hlavní Opatření projektu"},null,null,null,null,null,null,null,10,"1.3.2 Zpracování studií a plánů (studie systémů sídelní zeleně, územní studie krajiny, plán územního systému ekologické stability)","4_2",null,null,"GBER ŽP článek 41",null,null," "]
[null,null,null,{"$f":"CHOOSE($C$1,$M$1,M4,M9,M12,M22,M27,M38)","v":"Vyber nejprve Specifický cíl a poté hlavní Opatření projektu"},null,null,null,null,null,null,null,11,"1.3.3 Realizace protipovodňových opatření","4_3",null,null,"GBER ŽP článek 45",null,null," "]
[null,null,null,{"$f":"CHOOSE($C$1,$M$1,M5,\"irelevantní\",M13,M23,M28,M39)","v":"Vyber nejprve Specifický cíl a poté hlavní Opatření projektu"},null,null,null,null,null,null,null,12,"1.3.4 Realizace opatření ke zpomalení odtoku, pro vsak, retenci a akumulaci srážkové vody vč. jejího dalšího využití; realizace zelených střech; opatření na využití šedé vody; opatření pro řízenou dotaci podzemních vod","4_4",null,null,"GBER ŽP článek 46"]
[null,null,null,{"$f":"CHOOSE($C$1,$M$1,M6,\"irelevantní\",M14,M24,M29,M40)","v":"Vyber nejprve Specifický cíl a poté hlavní Opatření projektu"},null,null,null,null,null,null,null,13,"1.3.5 Podpora preventivních opatření proti povodním a suchu, zejména budování, rozšíření, zkvalitnění a obnova monitorovacích, předpovědních, hlásných, výstražných a varovných systémů; zpracování digitálních povodňových plánů, zpracování analýzy odtokových poměrů ","4_5",null,null,"GBER ŽP článek 47"]
[null,null,null,{"$f":"CHOOSE($C$1,$M$1,\"irelevantní\",\"irelevantní\",M15,\"irelevantní\",M30,M41)","v":"Vyber nejprve Specifický cíl a poté hlavní Opatření projektu"},null,null,null,null,"kurz euro Kč",null,null,14,"1.3.6 Podpora povodňové operativy, zvyšování povědomí obyvatel o povodňovém riziku, zvyšování resilience citlivých objektů před povodněmi","4_6",null,null,"GBER ŽP článek 49"]
[null,null,null,{"$f":"CHOOSE($C$1,$M$1,\"irelevantní\",\"irelevantní\",M16,\"irelevantní\",M31,M42)","v":"Vyber nejprve Specifický cíl a poté hlavní Opatření projektu"},null,null,null,null,24.739000000000001,null,null,15,"1.3.7 Monitoring a rebilance dlouhodobě využitelných zdrojů podzemních vod pro obce v krystaliniku Českého masivu","4_7",null,null,"GBER článek 53, kulturní infrastruktura ",15]
[null,null,null,{"$f":"CHOOSE($C$1,$M$1,\"irelevantní\",\"irelevantní\",M17,\"irelevantní\",M32,M43)","v":"Vyber nejprve Specifický cíl a poté hlavní Opatření projektu"},null,null,null,null,null,null,null,16,"1.3.8 Obnova stability svahů, stabilizace a sanace extrémních svahových nestabilit vzniklých v důsledku přírodních jevů","4_8",null,null,"GBER článek 55, sportovní infrastruktura"]
[null,null,null,{"$f":"CHOOSE($C$1,$M$1,\"irelevantní\",\"irelevantní\",M18,\"irelevantní\",M33,\"irelevantní\")","v":"Vyber nejprve Specifický cíl a poté hlavní Opatření projektu"},null,null,null,null,null,null,null,17,"1.3.9 Investice do modernizace vzdělávacích environmentálních center zaměřených na změnu klimatu","4_9",null,null,"GBER článek 56, lokální infrastruktura"]
[null,null,null,{"$f":"CHOOSE($C$1,$M$1,\"irelevantní\",\"irelevantní\",M19,\"irelevantní\",M34,\"irelevantní\")","v":"Vyber nejprve Specifický cíl a poté hlavní Opatření projektu"},null,null,null,null,null,null,null,18,"1.3.10 Prevence a řízení antropogenních rizik","4_10",null,null,"SGEI Rozhodnutí Komise ",18]
[null,null,null,{"$f":"CHOOSE($C$1,$M$1,\"irelevantní\",\"irelevantní\",\"irelevantní\",\"irelevantní\",M35,\"irelevantní\")","v":"Vyber nejprve Specifický cíl a poté hlavní Opatření projektu"},null,null,null,null,null,null,null,19,"1.4.1 Výstavba čistíren odpadních vod; dobudování a výstavba kanalizaci ","5_1",null,null,"SGEI Nařízení Evropského parlamentu a Rady (ES) č. 1370/2007 – Doprava ",19]
{"$rows_left_out":64}
{"sheet":"KR výstup","index":2,"n_rows":36,"n_cols":4,"rows_kept":36,"cut":false,"hidden":true,"merged":[]}
[]
[]
[null,null,"Název žadatele:",0]
[null,null,"Název projektu:",0]
[null,null,"Specifický cíl:","Vyber Specifický cíl"]
[null,null,"Veřejná podpora:","mimo Veřejnou podporu"]
[null,null,"DPH uznatelnost:","Vyber"]
[null,null,"Velikost podniku:","irelevantní"]
[null,null,"Celkové náklady projektu","zadej výdaje/DPH"]
[null,null,"Celkové způsobilé výdaje projeku","zadej výdaje/DPH"]
[null,null,"Celkové nezpůsobilé výdaje projetku","zadej výdaje/DPH"]
[null,null,"Opatření specifického cíle (hlavní)","Vyber nejprve Specifický cíl a poté hlavní Opatření projektu"]
[null,null,"Opatření #2","vyber Opatření #2"]
[null,null,"Opatření #3","vyber Opatření #3"]
[null,null,"Opatření #4","vyber Opatření #4"]
[null,null,"Opatření #5","vyber Opatření #5"]
[null,null,"Opatření #6","vyber Opatření #6"]
[null,null,"Opatření #7","vyber Opatření #7"]
[null,null,"Opatření #8","vyber Opatření #8"]
[null,null,"Opatření #9","vyber Opatření #9"]
{"$rows_left_out":17}
{"sheet":"2) Stanovení jednotkové podpory","index":3,"n_rows":44,"n_cols":14,"rows_kept":44,"cut":false,"hidden":false,"merged":[[0,2,1,7],[21,6,21,7],[29,6,29,7],[24,1,26,1],[33,3,33,7],[2,2,2,6],[3,2,3,6],[12,1,13,1],[14,1,17,1],[31,3,31,7]]}
["Identifikace projektu",null,"Poznámka k vyplnění: Tabulka je optimalizována pro MS Excel 2010 a vyšší. Použití starší verze či jiného programu může způsobit problémy. Editujte pouze zelené buňky a zaškrtávací políčka, vybírejte z rozbalovacích menu. Řiďte se informacemi označenými červeným trojúhelníkem v pravém horním rohu buněk."]
[]
[null,"Název žadatele",{"$f":"'1) Kumulativní rozpočet'!C5:F5","v":0}]
[null,"Název projektu",{"$f":"'1) Kumulativní rozpočet'!C6:F6","v":0}]
[null,"Číslo výzvy",1]
[]
[null,"Památkově chráněná budova","NE"]
[null,"Budova sloužící pro výchovu a vzdělávání dětí a mladistvých","ANO"]
[null,"DPH je v rámci projektu způsobilým výdajem",{"$f":"IF('KR zdroj'!$P$26=4,\"Nezvoleno na 1. listu\",IF('KR zdroj'!$P$26=2,\"NE\",\"ANO\"))","v":"NE"}]
[null,"Stanovte příslušnou procentní výši DPH pro realizaci",{"$f":"'1) Kumulativní rozpočet'!E12/100","v":0.21}]
[true,"a) Instalace nuceného větrání s rekuperací"]
[null,null,null,null,null,"vlastní jednotkový  náklad Kč bez DPH/jedn.","hodnota","jednotka","jednotkový náklad bez DPH","k1","k2","jednotková dotace za opatření bez DPH","celková dotace za opatření bez DPH","Způsobilé přímé realizační výdaje"]
[null,"Celkový výkon nově instalovaných systémů nuceného větrání  - výukové prostory vzdělávacích budov","výkon na jednotku do 1500 m3",null,false,null,null,"počet žáků",{"$f":"'SJP Pomocné hodnoty'!F17","v":9800},{"$f":"IF(A11=TRUE,'SJP Pomocné hodnoty'!G17+'SJP Pomocné hodnoty'!H17,'SJP Pomocné hodnoty'!G17)","v":0.6},{"$f":"'SJP Pomocné hodnoty'!R17","v":0.6},{"$f":"IF(AND($C$7=\"ANO\",E13=TRUE),F13,I13)*J13*K13","v":3528},{"$f":"G13*L13","v":0},{"$f":"G13*IF(E13=TRUE,F13,I13)*J13","v":0}]
[null,null,"výkon na jednotku nad 1500 m3",null,false,null,null,"počet žáků",{"$f":"'SJP Pomocné hodnoty'!F18","v":9800},{"$f":"IF(A12=TRUE,'SJP Pomocné hodnoty'!G18+'SJP Pomocné hodnoty'!H18,'SJP Pomocné hodnoty'!G18)","v":1},{"$f":"'SJP Pomocné hodnoty'!R18","v":0.6},{"$f":"IF(AND($C$7=\"ANO\",E14=TRUE),F14,I14)*J14*K14","v":5880},0,{"$f":"G14*IF(E14=TRUE,F14,I14)*J14","v":0}]
[null,"Celkový výkon nově instalovaných systémů nuceného větrání s rekuperací - ostatní","výkon na jednotku do 1500 m3",null,false,null,null,"m3/hod",{"$f":"'SJP Pomocné hodnoty'!F19","v":390},{"$f":"IF(A13=TRUE,'SJP Pomocné hodnoty'!G19+'SJP Pomocné hodnoty'!H19,'SJP Pomocné hodnoty'!G19)","v":0.6},{"$f":"'SJP Pomocné hodnoty'!R19","v":0.6},140.4,0,0]
[null,null,"výkon na jednotku nad 1500 m3 - regulace průtoku ON/OFF",null,false,null,null,"m3/hod",{"$f":"'SJP Pomocné hodnoty'!F20","v":390},{"$f":"IF(A14=TRUE,'SJP Pomocné hodnoty'!G20+'SJP Pomocné hodnoty'!H20,'SJP Pomocné hodnoty'!G20)","v":0.5},{"$f":"'SJP Pomocné hodnoty'!R20","v":0.6},117,0,0]
[null,null,"výkon na jednotku nad 1500 m3 - regulace průtoku dle času, % výkonu jednotky a ostatní neuvedené",null,false,null,null,"m3/hod",{"$f":"'SJP Pomocné hodnoty'!F21","v":390},{"$f":"IF(A15=TRUE,'SJP Pomocné hodnoty'!G21+'SJP Pomocné hodnoty'!H21,'SJP Pomocné hodnoty'!G21)","v":0.7},{"$f":"'SJP Pomocné hodnoty'!R21","v":0.6},163.79999999999998,0,0]
[null,null,"výkon na jednotku nad 1500 m3 - plynulá regulace, např. CO2",null,false,null,null,"m3/hod",{"$f":"'SJP Pomocné hodnoty'!F22","v":390},{"$f":"IF(A16=TRUE,'SJP Pomocné hodnoty'!G22+'SJP Pomocné hodnoty'!H22,'SJP Pomocné hodnoty'!G22)","v":1},{"$f":"'SJP Pomocné hodnoty'!R22","v":0.6},234,0,0]
[]
[null,null,null,false]
{"$rows_left_out":25}
{"sheet":"SJP Pomocné hodnoty","index":4,"n_rows":29,"n_cols":18,"rows_kept":29,"cut":false,"hidden":true,"merged":[[23,0,25,0],[16,0,17,0],[18,0,21,0]]}
["A",null,null,null,null,null,"Číselník pro obecné parametry"]
["Úspora primární energie z neobnovitelných zdrojů",null,0.3,0.4,null,null,1,"Nepam",null,{"$f":"IF('2) Stanovení jednotkové podpory'!$C$7=\"NE\",IF('2) Stanovení jednotkové podpory'!$C$8=\"NE\",IF(AND('2) Stanovení jednotkové podpory'!#REF!=FALSE,'2) Stanovení jednotkové podpory'!#REF!=FALSE),1,3),IF(AND('2) Stanovení jednotkové podpory'!#REF!=FALSE,'2) Stanovení jednotkové podpory'!#REF!=FALSE),2,4)),IF('2) Stanovení jednotkové podpory'!$C$8=\"NE\",IF(AND('2) Stanovení jednotkové podpory'!#REF!=FALSE,#REF!=FALSE),5,7),IF(AND('2) Stanovení jednotkové podpory'!#REF!=FALSE,'2) Stanovení jednotkové podpory'!#REF!=FALSE,'2) Stanovení jednotkové podpory'!#REF!=FALSE),6,8)))","v":{"$error":"#REF!"}}]
["Dosažená hodnota primární energie z neobnovitelných zdrojů dle PENB pro stav po realizaci navržených opatření",null,0.85,0.7,null,null,2,"Nepam škola"]
["Průměrný součinitel prostupu tepla obálky budovy",null,0.95,0.8,null,null,3,"Nepam EPC"]
["Součinitel prostupu tepla pro měněné stavební prvky vyjma oken, na něž se vztahuje podpora",null,null,null,null,null,4,"Nepam škola EPC"]
["Součinitel prostupu tepla oken, na něž se vztahuje podpora",null,0.15,null,null,null,5,"Pam"]
["Nejvyšší denní teplota vzduchu v místnosti v letním období ",null,0.21,null,null,null,6,"Pam škola "]
["Koncept větrání",null,null,null,null,null,7,"Pam EPC"]
[null,null,"ANO",null,null,null,8,"Pam škola EPC"]
[null,null,"NE"]
[{"$f":"IF('2) Stanovení jednotkové podpory'!$A$11=TRUE,1,0)+IF('2) Stanovení jednotkové podpory'!$A$23=TRUE,1,0)+IF('2) Stanovení jednotkové podpory'!#REF!=TRUE,1,0)+IF('2) Stanovení jednotkové podpory'!#REF!=TRUE,1,0)","v":{"$error":"#REF!"}},"počet specifických cílů dotčených projektem"]
[null,"Specifický cíl 1.2 (po zatržení je nutno vybrat jedno z opatření v rozbalovacím menu u této buňky vpravo)"]
[null,"1.2.1 Výstavba a rekonstrukce obnovitelných zdrojů energie pro veřejné budovy"]
[null,"1.2.2 Výstavba a rekonstrukce obnovitelných zdrojů energie pro zajištění dodávek systémové energie ve veřejném sektoru"]
[]
[null,null,null,null,null,"jednotkové náklady bez DPH","k1",null,null,null,null,null,null,null,null,null,null,"k2"]
["Celkový výkon nově instalovaných systémů nuceného větrání  - výukové prostory vzdělávacích budov","výkon na jednotku do 1500 m3",null,null,null,9800,0.6,null,null,null,null,null,null,null,null,null,null,0.6]
[null,"výkon na jednotku nad 1500 m3",null,null,null,9800,1,null,null,null,null,null,null,null,null,null,null,{"$f":"$R$17","v":0.6}]
["Celkový výkon nově instalovaných systémů nuceného větrání s rekuperací - ostatní","výkon na jednotku do 1500 m3",null,null,null,390,0.6,null,null,null,null,null,null,null,null,null,null,{"$f":"$R$17","v":0.6}]
[null,"výkon na jednotku nad 1500 m3 - regulace průtoku ON/OFF",null,null,null,390,0.5,null,null,null,null,null,null,null,null,null,null,0.6]
{"$rows_left_out":10}
{"sheet":"3) Výsledná podpora v AIS","index":5,"n_rows":37,"n_cols":13,"rows_kept":37,"cut":false,"hidden":false,"merged":[[32,1,32,6],[18,6,18,7],[19,6,19,7],[21,6,21,7],[23,6,23,7],[32,7,32,8],[18,8,18,10],[19,8,19,10],[21,8,21,10],[23,8,23,10],[23,0,23,3],[19,4,19,5],[21,4,21,5],[18,4,18,5],[23,4,23,5],[32,9,32,10],[34,7,34,8],[34,9,34,10],[36,7,36,8],[36,9,36,10]]}
["Veřejná podpora"]
[]
["Typ veřejné podpory"]
[1]
[]
[null,null,null,null,null,null,null,null,"Stanovení výše podpory pro De minimis"]
[]
[null,null,null,null,null,null,null,null,"Předchozí čerpání de minimis v €"]
[null,null,null,null,null,null,null,null,"Aktuální kurz €",null,null,null,"https://commission.europa.eu/funding-tenders/procedures-guidelines-tenders/information-contractors-and-beneficiaries/exchange-rate-inforeuro_cs"]
[null,null,null,null,null,null,null,null,"Limit pro čerpání v Kč",null,null,{"$f":"IF(A4=2,(300000-L8)*L9,IF(A4=3,(750000-L8)*L9,\"\"))","v":""}]
[]
[]
[]
[null,null,null,null,false]
[]
[]
["Porovnání celkové podpory projektu dle pravidel výzvy a pravidel veřejné podpory"]
[]
[null,null,null,null,"Realizace",null,"PP+AD+TDI",null,"Celkem"]
["Dle pravidel výzvy",null,null,null,{"$f":"IF('1) Kumulativní rozpočet'!D12=0,0,MIN('1) Kumulativní rozpočet'!I13*0.85,'2) Stanovení jednotkové podpory'!D34))","v":0},null,{"$f":"IF('1) Kumulativní rozpočet'!D12=0,0,IF('2) Stanovení jednotkové podpory'!D32>'1) Kumulativní rozpočet'!I14,(IF(MIN('1) Kumulativní rozpočet'!I13,'2) Stanovení jednotkové podpory'!D32)>10000000,0.035,IF(MIN('1) Kumulativní rozpočet'!I13,'2) Stanovení jednotkové podpory'!D32)>3000000,0.05,0.07))*MIN('1) Kumulativní rozpočet'!I13,'2) Stanovení jednotkové podpory'!D32))*0.85,(IF(MIN('1) Kumulativní rozpočet'!I13,'2) Stanovení jednotkové podpory'!D32)>10000000,0.035,IF(MIN('1) Kumulativní rozpočet'!I13,'2) Stanovení jednotkové podpory'!D32)>3000000,0.05,0.07))*MIN('1) Kumulativní rozpočet'!I13,'2) Stanovení jednotkové podpory'!D32))))","v":0},null,{"$f":"SUM(E20:G20)","v":0}]
{"$rows_left_out":18}
{"sheet":"VP pomocné hodnoty","index":6,"n_rows":42,"n_cols":11,"rows_kept":42,"cut":false,"hidden":true,"merged":[[21,3,22,3],[21,4,22,4],[21,5,22,5],[21,6,22,6],[24,6,26,6],[36,1,36,2],[37,1,37,2],[38,1,38,2],[19,1,19,2],[20,1,20,2],[21,1,22,2],[23,1,23,2],[27,6,29,6],[33,1,35,1],[30,1,32,1],[27,1,29,1],[24,1,26,1],[30,6,32,6],[33,6,35,6]]}
[1,"mimo rámec veřejné podpory"]
[2,"De minimis 1407/2013"]
[3,"De minimis 360/2012 (SOHZ)"]
[4,"Rozhodnutí SOHZ"]
[5,"GBER (článek 38) Investiční podpora na opatření ke zvýšení energetické účinnosti "]
[6,"GBER (článek 40) Investiční podpora na vysokoúčinnou kombinovanou výrobu tepla a elektrické energie"]
[7,"GBER (článek 41) Investiční podpora energie z obnovitelných zdrojů"]
[8,"GBER (článek 53) Podpora kultury a zachování kulturního dědictví "]
[9,"GBER (článek 55) Podpora na sportovní a multifunkční rekreační infrastrukturu"]
[10,"GBER (článek 56) Investiční podpora na místní infrastrukturu"]
[]
[1,"Malý podnik"]
[2,"Střední podnik"]
[3,"Velký podnik a ostatní"]
[]
[1,"Praha (bez bonifikace)"]
[2,"regiony dle čl. 107 odst. 3 písm. a) Smlouvy o fungování EU"]
[3,"regiony dle čl. 107 odst. 3 písm. c) Smlouvy o fungování EU"]
[]
[null,"Předpis/článek",null,"Max VP v Praze","Max VP pro regiony dle čl. 107 odst. 3 písm. a) Smlouvy o fungování EU (1)","Max VP pro regiony dle čl. 107 odst. 3 písm.  c) Smlouvy o fungování EU (2)","Notifikační práh "]
{"$rows_left_out":22}